{"text_format":"1","workbook":"xlsx","n_sheets":4,"sheets":["入力","経過","男子","女子"],"not_rendered":{"charts":0,"images":0,"macros":1,"external_links":2,"defined_names":6,"comments":0,"pivot_tables":0},"unopened":[],"bounds":{"document_bytes":16777216,"sheet_cells":100000,"rows_first":2000,"rows_last":500,"rows_between":2000,"halvings":0,"cell_chars":16384,"cell_head_chars":4096},"cells_cut":0,"cells_raw":0,"read":"whole","date_system":"1900"}

{"sheet":"入力","index":0,"n_rows":121,"n_cols":22,"rows_kept":121,"cut":false,"hidden":false,"merged":[]}
[null,null,null,null,null,null,null,null,null,null,null,null,null,null,null,null,null,null,"春日井西部",null,null,"本郷"]
[null,null,"シート名","試合種類","試合番号","赤得点","白得点","勝ち色","処理","時間","赤","白"]
[null,null,"男子","１回戦","1-1",5,0,{"$f":"IF(OR(F3=\"\",G3=\"\"),\"\",IF(F3>G3,\"赤\",\"白\"))","v":"赤"},"処理済","10:53:49","小坂井","八幡"]
[null,null,"男子","１回戦","1-2",1,3,"白","処理済","11:13:56","一宮南部","碧南南"]
[null,null,"男子","１回戦","1-3",1,4,"白","処理済","11:15:53","東浦北部","守山西"]
[null,null,"女子","１回戦","1-4",1,2,"白","処理済","11:21:26","豊明","大府北"]
[null,null,"男子","２回戦","1-5",5,0,"赤","処理済","11:27:15","大成","小坂井"]
[null,null,"男子","２回戦","1-6",2,3,{"$f":"IF(OR(F8=\"\",G8=\"\"),\"\",IF(F8>G8,\"赤\",\"白\"))","v":"白"},"処理済","11:38:02","碧南南","桜丘"]
[null,null,"女子","２回戦","1-7",2,1,"赤","処理済","12:02:33","大成","大府北"]
[null,null,"女子","２回戦","1-8",2,1,"赤","処理済","12:04:38","形原","平坂"]
[null,null,"男子","３回戦","1-9",5,0,"赤","処理済","12:06:29","大成","守山西"]
[null,null,"女子","３回戦","1-10",2,1,"赤","処理済","12:55:41","大成","形原"]
[null,null,"男子","準々決勝","1-11",4,0,{"$f":"IF(OR(F13=\"\",G13=\"\"),\"\",IF(F13>G13,\"赤\",\"白\"))","v":"赤"},"処理済","12:55:17","大成","桜丘"]
[null,null,"女子","準々決勝","1-12",1,"1代","白","処理済","13:05:18","大成","高師台"]
[null,null,"男子","１回戦","2-1",3,2,"赤","処理済","10:51:08","一色","武豊"]
[null,null,"男子","１回戦","2-2",3,2,"赤","処理済","11:14:53","当知","岩倉南部"]
[null,null,"男子","１回戦","2-3",5,0,"赤","処理済","11:15:21","桜丘","天王"]
[null,null,"男子","１回戦","2-4",0,5,"白","処理済","11:19:07","神沢","春日井中部"]
[null,null,"女子","１回戦","2-5",1,2,"白","処理済","11:27:57","岩倉","春木"]
[null,null,"女子","１回戦","2-6",2,1,"赤","処理済","11:31:47","吉良","七宝"]
[null,null,"男子","２回戦","2-7",4,1,"赤","処理済","12:02:56","一色","当知"]
[null,null,"男子","２回戦","2-8",5,0,"赤","処理済","12:06:17","桜丘","春日井中部"]
[null,null,"女子","２回戦","2-9",2,1,"赤","処理済","12:08:18","高師台","春木"]
[null,null,"女子","２回戦","2-10",1,2,"白","処理済","12:09:14","吉良","乙川"]
[null,null,"男子","３回戦","2-11",2,3,"白","処理済","12:22:32","一色","桜丘"]
[null,null,"女子","３回戦","2-12",2,1,"赤","処理済","12:56:33","高師台","乙川"]
[null,null,"女子","準決勝","2-13",1,2,"白","ここを右クリック"]
[null,null,"男子","１回戦","3-1",4,0,"赤","処理済","10:49:22","志段味","鬼崎"]
[null,null,"男子","１回戦","3-2",null,"不戦勝","","処理済","10:55:49","佐屋","沓掛"]
[null,null,"男子","１回戦","3-3",4,1,"赤","処理済","11:16:27","横須賀","七宝"]
{"$rows_left_out":92}
{"sheet":"経過","index":1,"n_rows":33,"n_cols":10,"rows_kept":33,"cut":false,"hidden":false,"merged":[]}
[]
[]
[null,"最終報告試合",null,null,null,null,"平成23年度"]
[null,"会場","試合番号","試合種類","報告時間",null,"会場","試合番号","試合種類","報告時間"]
[null,"第１試合場","1-10","女子　３回戦","12:55:41",null,"第１試合場","1-14","女子　準決勝","13:56:38"]
[null,"第２試合場","2-12","女子　３回戦","12:56:33",null,"第２試合場","2-14","男子　準決勝","14:00:01"]
[null,"第３試合場","3-13","男子　準決勝","13:07:08",null,"第３試合場","3-13","女子　準々決勝","13:13:28"]
[null,"第４試合場","4-11","女子　３回戦","12:59:02",null,"第４試合場","4-13","男子　準々決勝","13:30:38"]
[null,"第５試合場","5-11","男子　準々決勝","13:03:30",null,"第５試合場","5-14","女子　準決勝","13:55:32"]
[null,"第６試合場","6-12","女子　３回戦","13:03:02",null,"第６試合場","6-14","男子　準決勝","14:05:54"]
[null,"第７試合場","7-12","女子　３回戦","13:00:45",null,"第７試合場","7-13","女子　準々決勝","13:21:05"]
[null,"第８試合場","8-10","女子　３回戦","12:08:39",null,"第８試合場","8-13","男子　準々決勝","13:20:42"]
[]
[null,null,null,null,null,null,"平成25年度"]
[null,null,null,null,null,null,"第１試合場","1-13","女子　３回戦","12:59:10"]
[null,null,null,null,null,null,"第２試合場","2-13","女子　準決勝","14:03:11"]
[null,null,null,null,null,null,"第３試合場","3-14","男子　準決勝","13:51:59"]
[null,null,null,null,null,null,"第４試合場","4-14","女子　準々決勝","13:25:01"]
[null,null,null,null,null,null,"第５試合場","5-14","男子　準々決勝","13:26:21"]
[null,null,null,null,null,null,"第６試合場","6-14","女子　準決勝","14:02:40"]
[null,null,null,null,null,null,"第７試合場","7-14","男子　準決勝","14:07:45"]
[null,null,null,null,null,null,"第８試合場","8-14","女子　準々決勝","13:31:54"]
[]
[null,null,null,null,null,null,"平成２７年度"]
[null,null,null,null,null,null,"会場","試合番号","試合種類","報告時間"]
[null,null,null,null,null,null,"第１試合場","1-15","男子　準々決勝",0.55386574074074069]
[null,null,null,null,null,null,"第２試合場","2-16","女子　準決勝",0.56586805555555553]
[null,null,null,null,null,null,"第３試合場","3-16","男子　準決勝",0.56876157407407402]
[null,null,null,null,null,null,"第４試合場","4-15","女子　準々決勝",0.55791666666666673]
[null,null,null,null,null,null,"第５試合場","5-15","男子　準々決勝",0.56365740740740744]
{"$rows_left_out":4}
{"sheet":"男子","index":2,"n_rows":79,"n_cols":30,"rows_kept":79,"cut":false,"hidden":false,"merged":[[78,27,79,27],[78,28,79,28],[70,29,71,29],[72,29,73,29],[74,29,75,29],[76,29,77,29],[78,29,79,29],[74,27,75,27],[74,28,75,28],[70,27,71,27],[70,28,71,28],[76,3,77,3],[76,4,77,4],[76,5,77,5],[76,6,77,6],[76,7,77,7],[76,27,77,27],[76,28,77,28],[74,3,75,3],[74,4,75,4],[74,5,75,5],[74,6,75,6],[74,7,75,7],[72,3,73,3],[72,4,73,4],[72,5,73,5],[72,6,73,6],[72,7,73,7],[72,27,73,27],[72,28,73,28],[70,3,71,3],[70,4,71,4],[70,5,71,5],[70,6,71,6],[70,7,71,7],[68,8,69,8],[68,25,69,25],[68,26,69,26],[68,27,69,27],[68,28,69,28],[68,29,69,29],[68,2,69,2],[68,3,69,3],[68,4,69,4],[68,5,69,5],[68,6,69,6],[68,7,69,7],[66,8,67,8],[66,25,67,25],[66,26,67,26],[66,27,67,27],[66,28,67,28],[66,29,67,29],[66,2,67,2],[66,3,67,3],[66,4,67,4],[66,5,67,5],[66,6,67,6],[66,7,67,7],[64,8,65,8],[64,25,65,25],[64,26,65,26],[64,2,65,2],[64,3,65,3],[64,4,65,4],[64,5,65,5],[64,6,65,6],[64,7,65,7],[62,8,63,8],[62,25,63,25],[62,26,63,26],[62,27,63,27],[62,28,63,28],[62,29,63,29],[62,2,63,2],[62,3,63,3],[62,4,63,4],[62,5,63,5],[62,6,63,6],[62,7,63,7],[60,8,61,8],[60,25,61,25],[60,26,61,26],[60,27,61,27],[60,28,61,28],[60,29,61,29],[60,2,61,2],[60,3,61,3],[60,4,61,4],[60,5,61,5],[60,6,61,6],[60,7,61,7],[58,8,59,8],[58,25,59,25],[58,26,59,26],[58,27,59,27],[58,28,59,28],[58,29,59,29],[58,2,59,2],[58,3,59,3],[58,4,59,4],[58,5,59,5],[58,6,59,6],[58,7,59,7],[56,8,57,8],[56,25,57,25],[56,26,57,26],[56,27,57,27],[56,28,57,28],[56,29,57,29],[56,2,57,2],[56,3,57,3],[56,4,57,4],[56,5,57,5],[56,6,57,6],[56,7,57,7],[54,8,55,8],[54,25,55,25],[54,26,55,26],[54,27,55,27],[54,28,55,28],[54,29,55,29],[54,2,55,2],[54,3,55,3],[54,4,55,4],[54,5,55,5],[54,6,55,6],[54,7,55,7],[52,8,53,8],[52,25,53,25],[52,26,53,26],[52,27,53,27],[52,28,53,28],[52,29,53,29],[52,2,53,2],[52,3,53,3],[52,4,53,4],[52,5,53,5],[52,6,53,6],[52,7,53,7],[50,8,51,8],[50,25,51,25],[50,26,51,26],[50,27,51,27],[50,28,51,28],[50,29,51,29],[50,2,51,2],[50,3,51,3],[50,4,51,4],[50,5,51,5],[50,6,51,6],[50,7,51,7],[48,8,49,8],[48,25,49,25],[48,26,49,26],[48,27,49,27],[48,28,49,28],[48,29,49,29],[48,2,49,2],[48,3,49,3],[48,4,49,4],[48,5,49,5],[48,6,49,6],[48,7,49,7],[46,8,47,8],[46,25,47,25],[46,26,47,26],[46,27,47,27],[46,28,47,28],[46,29,47,29],[46,2,47,2],[46,3,47,3],[46,4,47,4],[46,5,47,5],[46,6,47,6],[46,7,47,7],[44,8,45,8],[44,25,45,25],[44,26,45,26],[44,27,45,27],[44,28,45,28],[44,29,45,29],[44,2,45,2],[44,3,45,3],[44,4,45,4],[44,5,45,5],[44,6,45,6],[44,7,45,7],[42,8,43,8],[42,25,43,25],[42,26,43,26],[42,27,43,27],[42,28,43,28],[42,29,43,29],[42,2,43,2],[42,3,43,3],[42,4,43,4],[42,5,43,5],[42,6,43,6],[42,7,43,7],[40,8,41,8],[40,25,41,25],[40,26,41,26],[40,27,41,27],[40,28,41,28],[40,29,41,29],[34,15,34,18],[40,2,41,2],[40,3,41,3],[40,4,41,4],[40,5,41,5],[40,6,41,6],[40,7,41,7],[38,8,39,8],[38,25,39,25],[38,26,39,26],[38,27,39,27],[38,28,39,28],[38,29,39,29],[38,2,39,2],[38,3,39,3],[38,4,39,4],[38,5,39,5],[38,6,39,6],[38,7,39,7],[36,8,37,8],[36,25,37,25],[36,26,37,26],[36,27,37,27],[36,28,37,28],[36,29,37,29],[36,2,37,2],[36,3,37,3],[36,4,37,4],[36,5,37,5],[36,6,37,6],[36,7,37,7],[34,8,35,8],[34,25,35,25],[34,26,35,26],[34,27,35,27],[34,28,35,28],[34,29,35,29],[34,2,35,2],[34,3,35,3],[34,4,35,4],[34,5,35,5],[34,6,35,6],[34,7,35,7],[32,8,33,8],[32,25,33,25],[32,26,33,26],[32,27,33,27],[32,28,33,28],[32,29,33,29],[32,2,33,2],[32,3,33,3],[32,4,33,4],[32,5,33,5],[32,6,33,6],[32,7,33,7],[30,8,31,8],[30,25,31,25],[30,26,31,26],[30,27,31,27],[30,28,31,28],[30,29,31,29],[30,2,31,2],[30,3,31,3],[30,4,31,4],[30,5,31,5],[30,6,31,6],[30,7,31,7],[24,28,25,28],[24,29,25,29],[28,8,29,8],[28,25,29,25],[28,26,29,26],[28,27,29,27],[28,28,29,28],[28,29,29,29],[28,2,29,2],[28,3,29,3],[28,4,29,4],[28,5,29,5],[28,6,29,6],[28,7,29,7],[22,29,23,29],[24,2,25,2],[24,3,25,3],[24,4,25,4],[24,5,25,5],[24,6,25,6],[24,7,25,7],[24,8,25,8],[17,16,32,17],[24,25,25,25],[22,7,23,7],[22,8,23,8],[22,25,23,25],[22,26,23,26],[22,27,23,27],[22,28,23,28],[26,8,27,8],[26,25,27,25],[26,26,27,26],[26,27,27,27],[26,28,27,28],[26,29,27,29],[24,26,25,26],[24,27,25,27],[18,8,19,8],[18,25,19,25],[18,26,19,26],[22,2,23,2],[22,3,23,3],[22,4,23,4],[22,5,23,5],[22,6,23,6],[26,2,27,2],[26,3,27,3],[26,4,27,4],[26,5,27,5],[26,6,27,6],[26,7,27,7],[14,8,15,8],[14,25,15,25],[14,26,15,26],[18,27,19,27],[18,28,19,28],[18,29,19,29],[20,2,21,2],[20,3,21,3],[20,4,21,4],[20,5,21,5],[20,6,21,6],[20,7,21,7],[20,8,21,8],[20,25,21,25],[20,26,21,26],[20,27,21,27],[20,28,21,28],[20,29,21,29],[18,2,19,2],[18,3,19,3],[18,4,19,4],[18,5,19,5],[18,6,19,6],[18,7,19,7],[12,27,13,27],[12,28,13,28],[12,29,13,29],[14,27,15,27],[14,28,15,28],[14,29,15,29],[16,2,17,2],[16,3,17,3],[16,4,17,4],[16,5,17,5],[16,6,17,6],[16,29,17,29],[16,7,17,7],[16,8,17,8],[16,25,17,25],[16,26,17,26],[16,27,17,27],[16,28,17,28],[14,2,15,2],[14,3,15,3],[14,4,15,4],[14,5,15,5],[14,6,15,6],[14,7,15,7],[12,2,13,2],[12,3,13,3],[12,4,13,4],[12,5,13,5],[12,6,13,6],[12,7,13,7],[12,8,13,8],[12,25,13,25],[12,26,13,26],[8,27,9,27],[8,28,9,28],[8,29,9,29],[10,2,11,2],[10,3,11,3],[10,4,11,4],[10,5,11,5],[10,6,11,6],[10,29,11,29],[10,7,11,7],[10,8,11,8],[10,25,11,25],[10,26,11,26],[10,27,11,27],[10,28,11,28],[8,2,9,2],[8,3,9,3],[8,4,9,4],[8,5,9,5],[8,6,9,6],[8,7,9,7],[8,8,9,8],[8,25,9,25],[8,26,9,26],[4,2,5,2],[4,3,5,3],[4,4,5,4],[4,5,5,5],[4,6,5,6],[4,29,5,29],[6,2,7,2],[6,3,7,3],[6,4,7,4],[6,5,7,5],[6,6,7,6],[6,7,7,7],[6,8,7,8],[6,25,7,25],[6,26,7,26],[4,7,5,7],[4,8,5,8],[4,25,5,25],[4,26,5,26],[4,27,5,27],[4,28,5,28],[6,27,7,27],[6,28,7,28],[6,29,7,29]]}
[null,null,null,null,null,null,null,null,null,null,null,null,null,null,null,null,null,null,null,null,null,null,null,null,null,null,null,null,null,"第35回愛知県新人柔道大会"]
[null,null,null,null,null,null,null,null,null,null,null,null,null,null,null,null,null,null,null,null,null,null,null,null,null,null,null,null,null,"平成30年11月3日"]
[null,null,null,"男子",null,null,null,null,null,null,null,null,null,null,null,null,null,null,null,null,null,null,null,null,null,null,null,null,null,"愛知県武道館"]
[]
[null,null,null,1,"西尾張",1,{"$f":"VLOOKUP(E5&F5,[2]男子!$C$2:$D$75,2,)","v":"大成"},{"$f":"E5","v":"西尾張"},1,null,null,5,null,null,null,null,null,null,null,null,null,null,4,null,null,"知多",1,"みよし北","西三河",32]
[null,null,null,null,null,null,null,null,null,null,null,"1-5",5,null,null,null,null,null,null,null,null,3,"5-5"]
[null,null,null,2,"東三河",7,{"$f":"VLOOKUP(E7&F7,[2]男子!$C$2:$D$75,2,)","v":"小坂井"},{"$f":"E7","v":"東三河"},65,null,5,null,null,null,null,null,null,null,null,null,null,null,null,0,null,"名古屋",7,"名古屋","名古屋",33]
[null,null,null,null,null,null,null,null,null,null,"1-1",null,null,null,null,null,null,null,null,null,null,null,null,"5-1"]
[null,null,null,3,"知多",12,{"$f":"VLOOKUP(E9&F9,[2]男子!$C$2:$D$75,2,)","v":"八幡"},{"$f":"E9","v":"知多"},64,null,null,0,null,null,null,null,null,null,null,null,null,null,1,null,null,"西尾張",14,"大府北","知多",34]
[null,null,null,null,null,null,null,null,null,null,0,null,"1-9",4,null,null,null,null,null,null,1,"5-9",null,5]
[null,null,null,4,"西尾張",13,{"$f":"VLOOKUP(E11&F11,[2]男子!$C$2:$D$75,2,)","v":"一宮南部"},{"$f":"E11","v":"西尾張"},33,null,1,null,null,null,null,null,null,null,null,null,null,null,null,2,null,"東三河",5,"本郷","東三河",35]
[null,null,null,null,null,null,null,null,null,null,"1-2",2,null,null,null,null,null,null,null,null,null,null,"2代","5-2"]
[null,null,null,5,"西三河",6,{"$f":"VLOOKUP(E13&F13,[2]男子!$C$2:$D$75,2,)","v":"碧南南"},{"$f":"E13","v":"西三河"},32,null,null,null,null,null,null,null,null,null,null,null,null,null,null,null,null,"知多",16,"甚目寺南","西尾張",36]
[null,null,null,null,null,null,null,null,null,null,3,"1-6",null,null,null,null,null,null,null,null,null,null,"5-6",3]
[null,null,null,6,"知多",10,{"$f":"VLOOKUP(E15&F15,[2]男子!$C$2:$D$75,2,)","v":"東浦北部"},{"$f":"E15","v":"知多"},17,null,1,null,0,null,null,null,null,null,null,null,null,2,null,null,null,"西三河",8,"三好","西三河",37]
[null,null,null,null,null,null,null,null,null,null,"1-3",null,null,null,null,null,null,null,null,null,null,null,null,"5-3"]
[null,null,null,7,"名古屋",3,{"$f":"VLOOKUP(E17&F17,[2]男子!$C$2:$D$75,2,)","v":"守山西"},{"$f":"E17","v":"名古屋"},48,null,null,3,null,null,null,null,null,null,null,null,null,null,2,null,null,"知多",17,"阿久比","知多",38]
[null,null,null,null,null,null,null,null,null,null,4,null,null,"1-11",5,null,"私立大成中学校",null,null,"3","5-11",null,null,"不戦勝"]
[null,null,null,8,"西三河",2,{"$f":"VLOOKUP(E19&F19,[2]男子!$C$2:$D$75,2,)","v":"一色"},{"$f":"E19","v":"西三河"},49,null,3,null,null,null,null,null,null,null,null,null,null,null,null,1,null,"西尾張",3,"豊明","愛日",39]
[null,null,null,null,null,null,null,null,null,null,"2-1",4,null,null,null,null,null,null,null,null,null,null,"2","6-1"]
[null,null,null,9,"知多",4,{"$f":"VLOOKUP(E21&F21,[2]男子!$C$2:$D$75,2,)","v":"武豊"},{"$f":"E21","v":"知多"},16,null,null,null,null,null,null,null,null,null,null,null,null,null,null,null,null,"名古屋",2,"旭南","知多",40]
[null,null,null,null,null,null,null,null,null,null,2,"2-7",2,null,null,null,null,null,null,null,null,1,2,3]
[null,null,null,10,"名古屋",6,{"$f":"VLOOKUP(E23&F23,[2]男子!$C$2:$D$75,2,)","v":"当知"},{"$f":"E23","v":"名古屋"},9,null,3,null,null,null,null,null,null,null,null,null,null,null,null,3,null,"知多",8,"扶桑北","西尾張",41]
[null,null,null,null,null,null,null,null,null,null,"2-2",null,null,null,null,null,null,null,null,null,null,null,null,"6-2"]
[null,null,null,11,"西尾張",5,{"$f":"VLOOKUP(E25&F25,[2]男子!$C$2:$D$75,2,)","v":"岩倉南部"},{"$f":"E25","v":"西尾張"},73,null,null,1,null,null,null,null,null,null,null,null,null,null,3,null,null,"西尾張",11,"二川","東三河",42]
[null,null,null,null,null,null,null,null,null,null,2,null,"2-11",null,null,null,null,null,null,null,null,"6-11",null,1]
[null,null,null,12,"東三河",3,{"$f":"VLOOKUP(E27&F27,[2]男子!$C$2:$D$75,2,)","v":"桜丘"},{"$f":"E27","v":"東三河"},56,null,5,null,null,0,null,null,null,null,null,null,4,null,null,3,null,"愛日",4,"竜北","西三河",43]
[null,null,null,null,null,null,null,null,null,null,"2-3",5,null,null,null,null,null,null,null,null,null,null,1,"6-3"]
[null,null,null,13,"西尾張",11,{"$f":"VLOOKUP(E29&F29,[2]男子!$C$2:$D$75,2,)","v":"天王"},{"$f":"E29","v":"西尾張"},41,null,null,null,null,null,null,null,null,null,null,null,null,null,null,null,null,"東三河",4,"知多","知多",44]
[null,null,null,null,null,null,null,null,null,null,0,"2-8",null,null,null,null,null,null,null,null,null,null,"6-8",2]
{"$rows_left_out":50}
{"sheet":"女子","index":3,"n_rows":57,"n_cols":31,"rows_kept":57,"cut":false,"hidden":false,"merged":[[52,28,53,28],[54,28,55,28],[56,27,57,27],[34,28,35,28],[36,28,37,28],[38,28,39,28],[40,28,41,28],[42,28,43,28],[44,28,45,28],[46,28,47,28],[48,28,49,28],[50,28,51,28],[18,33,31,34],[20,28,21,28],[22,28,23,28],[24,28,25,28],[25,14,25,17],[26,28,27,28],[28,28,29,28],[30,28,31,28],[32,28,33,28],[4,28,5,28],[6,28,7,28],[8,15,23,16],[8,28,9,28],[10,28,11,28],[12,28,13,28],[14,28,15,28],[16,28,17,28],[18,28,19,28],[56,8,57,8],[56,23,57,23],[56,24,57,24],[56,26,57,26],[56,2,57,2],[56,3,57,3],[56,4,57,4],[56,5,57,5],[56,6,57,6],[56,7,57,7],[54,8,55,8],[54,23,55,23],[54,24,55,24],[54,26,55,26],[54,27,55,27],[54,2,55,2],[54,3,55,3],[54,4,55,4],[54,5,55,5],[54,6,55,6],[54,7,55,7],[52,8,53,8],[52,23,53,23],[52,24,53,24],[52,26,53,26],[52,27,53,27],[52,2,53,2],[52,3,53,3],[52,4,53,4],[52,5,53,5],[52,6,53,6],[52,7,53,7],[50,8,51,8],[50,23,51,23],[50,24,51,24],[50,26,51,26],[50,27,51,27],[50,2,51,2],[50,3,51,3],[50,4,51,4],[50,5,51,5],[50,6,51,6],[50,7,51,7],[48,8,49,8],[48,23,49,23],[48,24,49,24],[48,26,49,26],[48,27,49,27],[48,2,49,2],[48,3,49,3],[48,4,49,4],[48,5,49,5],[48,6,49,6],[48,7,49,7],[46,8,47,8],[46,23,47,23],[46,24,47,24],[46,26,47,26],[46,27,47,27],[46,2,47,2],[46,3,47,3],[46,4,47,4],[46,5,47,5],[46,6,47,6],[46,7,47,7],[44,8,45,8],[44,23,45,23],[44,24,45,24],[44,26,45,26],[44,27,45,27],[44,2,45,2],[44,3,45,3],[44,4,45,4],[44,5,45,5],[44,6,45,6],[44,7,45,7],[42,8,43,8],[42,23,43,23],[42,24,43,24],[42,26,43,26],[42,27,43,27],[42,2,43,2],[42,3,43,3],[42,4,43,4],[42,5,43,5],[42,6,43,6],[42,7,43,7],[40,8,41,8],[40,23,41,23],[40,24,41,24],[40,26,41,26],[40,27,41,27],[40,2,41,2],[40,3,41,3],[40,4,41,4],[40,5,41,5],[40,6,41,6],[40,7,41,7],[38,8,39,8],[38,23,39,23],[38,24,39,24],[38,26,39,26],[38,27,39,27],[38,2,39,2],[38,3,39,3],[38,4,39,4],[38,5,39,5],[38,6,39,6],[38,7,39,7],[36,8,37,8],[36,23,37,23],[36,24,37,24],[36,26,37,26],[36,27,37,27],[36,2,37,2],[36,3,37,3],[36,4,37,4],[36,5,37,5],[36,6,37,6],[36,7,37,7],[34,8,35,8],[34,23,35,23],[34,24,35,24],[34,26,35,26],[34,27,35,27],[34,2,35,2],[34,3,35,3],[34,4,35,4],[34,5,35,5],[34,6,35,6],[34,7,35,7],[32,8,33,8],[32,23,33,23],[32,24,33,24],[32,26,33,26],[32,27,33,27],[32,2,33,2],[32,3,33,3],[32,4,33,4],[32,5,33,5],[32,6,33,6],[32,7,33,7],[30,8,31,8],[30,23,31,23],[30,24,31,24],[30,26,31,26],[30,27,31,27],[30,2,31,2],[30,3,31,3],[30,4,31,4],[30,5,31,5],[30,6,31,6],[30,7,31,7],[28,8,29,8],[28,23,29,23],[28,24,29,24],[28,26,29,26],[28,27,29,27],[28,2,29,2],[28,3,29,3],[28,4,29,4],[28,5,29,5],[28,6,29,6],[28,7,29,7],[26,8,27,8],[26,23,27,23],[26,24,27,24],[26,26,27,26],[26,27,27,27],[26,2,27,2],[26,3,27,3],[26,4,27,4],[26,5,27,5],[26,6,27,6],[26,7,27,7],[24,8,25,8],[24,23,25,23],[24,24,25,24],[24,26,25,26],[24,27,25,27],[24,2,25,2],[24,3,25,3],[24,4,25,4],[24,5,25,5],[24,6,25,6],[24,7,25,7],[22,8,23,8],[22,23,23,23],[22,24,23,24],[22,26,23,26],[22,27,23,27],[22,2,23,2],[22,3,23,3],[22,4,23,4],[22,5,23,5],[22,6,23,6],[22,7,23,7],[20,8,21,8],[20,23,21,23],[20,24,21,24],[20,26,21,26],[20,27,21,27],[20,2,21,2],[20,3,21,3],[20,4,21,4],[20,5,21,5],[20,6,21,6],[20,7,21,7],[16,7,17,7],[18,8,19,8],[18,23,19,23],[18,24,19,24],[18,26,19,26],[18,27,19,27],[18,2,19,2],[18,3,19,3],[18,4,19,4],[18,5,19,5],[18,6,19,6],[18,7,19,7],[16,8,17,8],[16,23,17,23],[16,24,17,24],[16,26,17,26],[16,27,17,27],[16,2,17,2],[16,3,17,3],[16,4,17,4],[16,5,17,5],[16,6,17,6],[14,8,15,8],[14,23,15,23],[14,24,15,24],[14,26,15,26],[14,27,15,27],[14,2,15,2],[14,3,15,3],[14,4,15,4],[14,5,15,5],[14,6,15,6],[14,7,15,7],[12,8,13,8],[12,23,13,23],[12,24,13,24],[12,26,13,26],[12,27,13,27],[12,2,13,2],[12,3,13,3],[12,4,13,4],[12,5,13,5],[12,6,13,6],[12,7,13,7],[10,8,11,8],[10,23,11,23],[10,24,11,24],[10,26,11,26],[10,27,11,27],[10,2,11,2],[10,3,11,3],[10,4,11,4],[10,5,11,5],[10,6,11,6],[10,7,11,7],[8,8,9,8],[8,23,9,23],[8,24,9,24],[8,26,9,26],[8,27,9,27],[8,2,9,2],[8,3,9,3],[8,4,9,4],[8,5,9,5],[8,6,9,6],[8,7,9,7],[6,8,7,8],[6,23,7,23],[6,24,7,24],[6,26,7,26],[6,27,7,27],[6,2,7,2],[6,3,7,3],[6,4,7,4],[6,5,7,5],[6,6,7,6],[6,7,7,7],[4,8,5,8],[4,23,5,23],[4,24,5,24],[4,26,5,26],[4,27,5,27],[4,2,5,2],[4,3,5,3],[4,4,5,4],[4,5,5,5],[4,6,5,6],[4,7,5,7]]}
[null,null,null,null,null,null,null,null,null,null,null,null,null,null,null,null,null,null,null,null,null,null,null,null,null,null,null,null,"第35回愛知県新人柔道大会"]
[null,null,null,null,null,null,null,null,null,null,null,null,null,null,null,null,null,null,null,null,null,null,null,null,null,null,null,null,"平成30年11月3日"]
[null,null,null,"女子",null,null,null,null,null,null,null,null,null,null,null,null,null,null,null,null,null,null,null,null,null,null,null,null,"愛知県武道館"]
[]
[null,null,null,1,"西尾張",1,"大成","西尾張",null,null,2,null,null,null,null,null,null,null,null,null,null,2,null,"愛日",1,null,"春日井西部","愛日",22]
[null,null,null,null,null,null,null,null,null,null,"1-7",2,null,null,null,null,null,null,null,null,2,"5-7",null,null,null,null,null,null,null,null,"西尾張"]
[null,null,null,2,"愛日",8,"豊明","愛日",null,1,null,null,null,null,null,null,null,null,null,null,null,null,0,"西尾張",9,null,"美和","西尾張",23,null,"知多"]
[null,null,null,null,null,null,null,null,null,"1-4",null,null,null,null,null,null,null,null,null,null,null,null,"5-4",null,null,null,null,null,null,null,"愛日"]
[null,null,null,3,"知多",5,"大府北","知多",null,null,1,"1-10","1",null,null,"私立桜丘中学校",null,null,null,"2","5-10",1,null,"東三河",6,null,"本郷","東三河",24,null,"名古屋"]
[null,null,null,null,null,null,null,null,null,2,null,null,null,null,null,null,null,null,null,null,null,null,2,null,null,null,null,null,null,null,"西三河"]
[null,null,null,4,"東三河",5,"形原","東三河",null,null,2,null,null,null,null,null,null,null,null,null,null,1,null,"知多",3,null,"青山","知多",25,null,"東三河"]
[null,null,null,null,null,null,null,null,null,null,"1-8",null,null,null,null,null,null,null,null,null,null,"5-8"]
[null,null,null,5,"西三河",4,"平坂","西三河",null,null,null,1,null,null,null,null,null,null,null,null,1,null,null,"名古屋",3,null,"植田","名古屋",26]
[null,null,null,null,null,null,null,null,null,null,1,null,"2-13","1",null,null,null,null,"0","5-11",null,2]
[null,null,null,6,"東三河",3,"高師台","東三河",null,null,2,null,null,null,null,null,null,null,null,null,null,2,null,"西三河",2,null,"高岡","西三河",27]
[null,null,null,null,null,null,null,null,null,null,"2-9",2,null,null,null,null,null,null,null,null,"1代","6-9"]
[null,null,null,7,"西尾張",10,"岩倉","西尾張",null,1,null,null,null,null,null,null,null,null,null,null,null,null,1,"西尾張",11,null,"一宮南部","西尾張",28]
[null,null,null,null,null,null,null,null,null,"2-5",null,null,null,null,null,null,null,null,null,null,null,null,"6-5"]
[null,null,null,8,"愛日",2,"春木","愛日",null,null,1,null,null,null,null,null,null,null,null,null,null,1,null,"愛日",6,null,"松原","愛日",29]
[null,null,null,null,null,null,null,null,null,2,null,"2-12",null,null,null,null,null,null,null,null,"6-12",null,2]
[null,null,null,9,"西三河",5,"吉良","西三河",null,2,null,null,"1代",null,null,null,null,null,null,"1",null,null,3,"東三河",4,null,"二川","東三河",30]
[null,null,null,null,null,null,null,null,null,"2-6",1,null,null,null,null,null,null,null,null,null,null,3,"6-6"]
[null,null,null,10,"西尾張",7,"七宝","西尾張",null,null,null,null,null,null,null,null,null,null,null,null,null,null,null,"知多",6,null,"武豊","知多",31]
[null,null,null,null,null,null,null,null,null,1,"2-10",null,null,null,null,null,null,null,null,null,null,"6-10",0]
[null,null,null,11,"知多",1,"乙川","知多",null,null,null,1,null,"2-13",null,null,null,null,"6-13",null,1,null,null,"西尾張",2,null,"大治","西尾張",32]
[null,null,null,null,null,null,null,null,null,null,2,null,null,"0","決勝2",null,null,null,"3",null,null,0]
[null,null,null,12,"西三河",1,"一色","西三河",null,null,3,null,null,null,null,null,null,null,null,null,null,3,null,"名古屋",2,null,"高針台","名古屋",33]
[null,null,null,null,null,null,null,null,null,null,"3-8",2,null,null,null,null,null,null,null,null,3,"7-9"]
[null,null,null,13,"愛日",4,"栄","愛日",null,1,null,null,null,null,null,null,null,null,null,null,null,null,2,"愛日",7,null,"諸輪","愛日",34]
[null,null,null,null,null,null,null,null,null,"3-5",null,null,null,null,null,null,null,null,null,null,null,null,"7-5"]
{"$rows_left_out":27}